CA/EC/CWS/NWRC
type: Concept
in scheme: providers
definition: The Canadian Wildlife Service (CWS), part of Environment Canada, handles wildlife matters that are the responsibility of the federal government. These include protection and management of migratory birds, nationally significant habitat and endangered species, as well as work on other wildlife issues of national and international importance. In addition, CWS does research in many fields of wildlife biology. Website: "http://www.ec.gc.ca/scitech/default.asp?lang=En&n=0B9A6436-1#nwrc" [Summary provided by Government of Canada, Environment Canada, National Wildlife Research Centre, Canadian Wildlife Service]

CANADA
type: Concept