FORESTS
type: Concept

TEMPERATE RAINFOREST
type: Concept
change note: 2016-06-13 12:11:10.0 [gee-cee] insert Definition (id: null text: Pertaining to forests in temperate latitudes characterized by high annual precipitation over 140 cm and infrequent fire. language code: en);
change note: 2016-06-13 12:10:38.0 [gee-cee] Insert Concept add broader relation (TEMPERATE RAINFOREST [96ea0bde-7cf6-4601-8a49-116636f556cf,188183] - FORESTS [46e4aaa4-349c-4049-a910-035391360010,83507]);
in scheme: sciencekeywords
definition: Pertaining to forests in temperate latitudes characterized by high annual precipitation over 140 cm and infrequent fire.