CONDUCTIVITY PROFILES
type: Concept
change note: 2021-10-21 08:38:14.0 [tstevens] insert Definition (id: null text: Vertical profiles of conductivity (used to determine salinity). language code: en);
change note: 2021-10-21 08:37:29.0 [tstevens] Insert Concept add broader relation (CONDUCTIVITY PROFILES [9709d1cb-e165-4aa5-be87-daa2989aac31,778230] - CONDUCTIVITY [7041e51c-e2de-405a-b154-6016f624f54f,776250]);
in scheme: sciencekeywords
definition: Vertical profiles of conductivity (used to determine salinity).

CONDUCTIVITY
type: Concept