DeepWorker 2000
type: Concept
change note: 2022-02-22 14:27:34.0 [tstevens] insert Definition (id: null text: A submarine vehicle developed by Nuytco Research, Ltd. It is capable of descending to a depth of 610 m (2001 ft) and remaining submerged for 12 hours. In 1999, it was deployed to the continental shelf and upper continental slope on a five-year mission in association with the National Geographic Society's Sustainable Seas Expeditions. language code: en);
change note: 2021-12-01 09:13:00.0 [tstevens] Insert Concept add broader relation (DeepWorker 2000 [97b4bebd-71e2-4ac5-9d75-fdb89b9eaba2,835923] - Subsurface [35f1c0af-8379-4812-a130-08d84514fc98,835899]);
in scheme: platforms
definition: A submarine vehicle developed by Nuytco Research, Ltd. It is capable of descending to a depth of 610 m (2001 ft) and remaining submerged for 12 hours. In 1999, it was deployed to the continental shelf and upper continental slope on a five-year mission in association with the National Geographic Society's Sustainable Seas Expeditions.

Subsurface
type: Concept