DRAINAGE DIRECTION
type: Concept
change note: 2016-04-04 09:14:27.0 [gee-cee] update Definition (Direction in which standing water is removed from am area.);
change note: 2016-03-31 09:15:16.0 [gee-cee] insert Definition (id: null text: Direction in which standing water is removed from am area language code: en);
change note: 2016-03-31 09:14:54.0 [gee-cee] Insert Concept add broader relation (DRAINAGE DIRECTION [97b68ee7-b729-4828-924d-d0758b43d8e9,158741] - DRAINAGE [269c7277-fa8f-4c1c-bd8b-ab772c1df4e5,83903]);
in scheme: sciencekeywords
definition: Direction in which standing water is removed from am area.

DRAINAGE
type: Concept