FLUVIAL LANDFORMS
type: Concept

WATERFALL
type: Concept
change note: 2013-08-15 13:18:14.0 [tbs1979] insert Definition (id: null text: A place where running water makes a sheer drop, usually over a cliff. language code: en);
change note: 2013-08-05 12:40:12.0 [tbs1979] Insert Concept add broader relation (WATERFALL [97c6eb84-90a8-4b47-9a22-99c7c1369989,105347] - FLUVIAL LANDFORMS [bdc0bd86-a3a3-48fa-b1fb-4ca5d13d4dde,105281]);
in scheme: sciencekeywords
definition: A place where running water makes a sheer drop, usually over a cliff.