NASA/GSFC/EOS/ESDIS/LANCE MODIS FIRMS
type: Concept
change note: 2014-03-20 18:24:17.0 [mpmorahan] Insert Concept add broader relation (NASA?GSFC/EOS/ESDIS/LANCE MODIS FIRMS [97cef66a-1523-472f-b154-dabbbc9b10ff,106245] - NASA [4fd0aa9d-1a80-4dde-8452-c69b5c4d08cc,66479]);
change note: 2017-06-12 14:24:46.0 [sritz] update Definition (Land, Atmosphere Near real-time Capability for EOS (LANCE) Moderate Resolution Imaging Spectroradiometer (MODIS) Fire Information for Resource Management System (FIRMS) https://earthdata.nasa.gov/earth-observation-data/near-real-time/firms);
change note: 2014-03-20 18:25:58.0 [mpmorahan] Rename Concept update PrefLabel (NASA/GSFC/EOS/ESDIS/LANCE MODIS FIRMS);
change note: 2014-03-20 18:31:22.0 [mpmorahan] insert AltLabel (id: null text: Land, Atmosphere Near real-time Capability for EOS (LANCE) Moderate Resolution Imaging Spectroradiometer (MODIS) Fire Information for Resource Management System (FIRMS) language code: en);
definition: Land, Atmosphere Near real-time Capability for EOS (LANCE) Moderate Resolution Imaging Spectroradiometer (MODIS) Fire Information for Resource Management System (FIRMS) https://earthdata.nasa.gov/earth-observation-data/near-real-time/firms
in scheme: providers

NASA
type: Concept