OSSI
type: Concept
in scheme: providers
definition: Open Source Software is recognized as a mainstream offering within industry and government IT environments. However, many within government agencies still face acquisition, policy and ideological challenges as they attempt to adopt and deploy open source systems. The goal of this moderated, interactive roundtable forum will be to collectively identify and address common adoption and policy challenges within government systems and exchange information and experience on solution strategies, available technical, business and government resources to help address and overcome these challenges. Summary Provided By: http://www.oss-institute.org/index.php?option=com_frontpage&Itemid=47

CONSORTIA/INSTITUTIONS
type: Concept