Z-ZNR
type: Concept
in scheme: providers
definition: The Zoological Nomenclature Resource (ZNR) is a database that contains Zoological nomenclature data. Birds of the World -- current valid scientific avian names. Sibley&Monroe; AOU Checklist (7th Ed.); Howard & Moore Checklist 3rd Ed. Subspecies follows Howard & Moore Birds of the World -- historical analysis of taxonomic activity. Website: "http://www.zoonomen.net/"

COMMERCIAL
type: Concept