SNOW/ICE
type: Concept

SNOW CLASSIFICATION
type: Concept
change note: 2021-11-02 13:16:54.0 [tstevens] insert Definition (id: null text: Describes local to global seasonal snow type for non-ice-covered terrestrial regions of Earth where snow falls. language code: en);
change note: 2021-11-02 13:14:52.0 [tstevens] Insert Concept add broader relation (SNOW CLASSIFICATION [97fd3b62-917d-4946-8c8a-29d2a15bf6dd,807059] - SNOW/ICE [aa35a52f-e3d9-41bd-abd2-ec7e1a8101d1,803746]);
in scheme: sciencekeywords
definition: Describes local to global seasonal snow type for non-ice-covered terrestrial regions of Earth where snow falls.