SDGI
type: Concept
change note: 2023-07-27 12:43:34.0 [tstevens] insert AltLabel (id: null category: primary text: Sustainable Development Goal Indicators language code: en); insert Definition (id: null text: The United Nations (UN) has established 17 Sustainable Development Goals (SDGs) in order to help shape a better future for our planet. In 2015 the UN Statistical Commission created the Inter-Agency and Expert Group on SDG Indicators (IAEG-SDGs), which developed over 200 indicators to monitor progress towards the SDGs. The Sustainable Development Goals Indicators (SDGI) collection provides globally consistent, regularly updated, operational data sets of SDG indicators. These data sets exemplify the potential of non-traditional global open data sources in bridging data gaps to help monitor SDG progress. Currently, the collection includes SDG indicators 7.1.1 (Access to Electricity), 9.1.1 (The Rural Access Index), 11.2.1 (Access to Public Transport), and 11.7.1 (Urban Public Space, Availability and Access). CIESIN plans to release regular updates of each indicator data set and is currently developing methodologies to compute additional indicator data sets. These data sets were developed in support of the Group on Earth Observations (GEO) Human Planet Initiative (HPI). language code: en);
change note: 2023-07-27 12:42:22.0 [tstevens] Insert Concept add broader relation (SDGI [99d2081c-b177-47cf-88ce-d2f50abaec24,1395065] - S - U [4eb1894b-35b4-406b-8864-944a42bc7702,1388347]);
in scheme: projects
definition: The United Nations (UN) has established 17 Sustainable Development Goals (SDGs) in order to help shape a better future for our planet. In 2015 the UN Statistical Commission created the Inter-Agency and Expert Group on SDG Indicators (IAEG-SDGs), which developed over 200 indicators to monitor progress towards the SDGs. The Sustainable Development Goals Indicators (SDGI) collection provides globally consistent, regularly updated, operational data sets of SDG indicators. These data sets exemplify the potential of non-traditional global open data sources in bridging data gaps to help monitor SDG progress. Currently, the collection includes SDG indicators 7.1.1 (Access to Electricity), 9.1.1 (The Rural Access Index), 11.2.1 (Access to Public Transport), and 11.7.1 (Urban Public Space, Availability and Access). CIESIN plans to release regular updates of each indicator data set and is currently developing methodologies to compute additional indicator data sets. These data sets were developed in support of the Group on Earth Observations (GEO) Human Planet Initiative (HPI).

S - U
type: Concept