CONSORTIA/INSTITUTIONS
type: Concept

TRINET
type: Concept
in scheme: providers
definition: Since 1988, thousands of companies throughout the United States and Canada have placed their trust in TriNet's small business HR services and payroll outsourcing programs to help them manage their human capital more strategically and cost-effectively. Summary Provided By: http://www.trinet.com/about_us/default.htm