UC-SEDE MEDELLIN/GEOSCI
type: Concept
in scheme: providers
definition: The School of Geosciences is the unit of administrative management academic of the Faculty of Sciences dedicated to the study of geoforms of the landscape and its interactions with the present atmosphere and the paleoambiente, the interactions between the ground and the vegetal nutrition, the microbial ecology of the ground and the handling and the conservation of the same one. Website: http://eris.unalmed.edu.co/~esgeocien/ Info: Geosci

ACADEMIC
type: Concept