STRATOS
type: Concept
change note: 2019-05-06 08:17:15.0 [mmorahan] insert Definition (id: null text: STRATOS makes use of GPS radio occultation measurements to determine temperature, pressure and humidity profiles of Earth's atmosphere for applications in operational meteorology, space weather, and climate. language code: en); insert WeightedRelation (id: null related concept uuid: da278af5-097b-47e7-903d-4deac395c4de relationship type: null relationship value: null generated by: null);
change note: 2019-05-06 08:14:42.0 [mmorahan] Insert Concept add broader relation (STRATOS [9a8265a0-1ff1-47ac-9204-f839ab508471,368777] - Imaging Spectrometers/Radiometers [944b7691-af37-4fb4-9393-c114e7997829,347979]);
in scheme: instruments
definition: STRATOS makes use of GPS radio occultation measurements to determine temperature, pressure and humidity profiles of Earth's atmosphere for applications in operational meteorology, space weather, and climate.

Imaging Spectrometers/Radiometers
type: Concept