A - C
type: Concept

AIRSTREAM
type: Concept
in scheme: projects
definition: Airstream began with a single man and a most singular dream. The man was Wally Byam: his dream, to build the perfect travel trailer. One that would move like a stream of air. One that would be light enough to be towed by a standard automobile. One that would provide first-class living accommodations anywhere in the world. Thus, over 70 years ago was born the first Airstream trailer. And with it was born yet another dream, a dream of new freedom, new places, new experiences, and new friendships. It was a dream so powerful, so enduring it did far more than create a new way of travel; it created a new way of life shared by thousands upon thousands of families. The Airstream philosophy has always been and will always be, " Let's not make any changes — let's make only improvements!" Every inch of an Airstream has a functional purpose. There is no planned obsolescence. This is as true in today's models as it was of the first Airstream to see the light of the open road. The classic Airstream of the thirties is no museum piece. Still in use today, it is as sturdy and modern in appearance as the first day it swung into traffic. As a result, an Airstream is always "in style' — conceived and constructed as a lifetime investment in happiness. Today, the Airstream is the most thoroughly tested Airstream in trailer history. It is years ahead in engineering — the culmination of over 70 years of experience in trailer making, millions of miles of Caravan travel throughout the world; plus millions of miles more, run up by happy Airstream owners! More than ever, the Airstream remains a testimonial to the practical vision, the tenacity and know-how of one dedicated man — Wally Byam, and his team who made your travel dreams come true. Summary provided by http://www.airstream.com/company/index.html