NASA
type: Concept

NASA/MSFC/GHRC/LANCE
type: Concept
change note: 2018-03-12 15:24:31.0 [tstevens] insert AltLabel (id: null category: primary text: Global Hydrology Resource Center, Marshall Space Flight Center, NASA - Land Atmosphere Near real-time Capability for EOS language code: en); insert Definition (id: null text: NASA’s Land, Atmosphere Near real-time Capability for Earth Observing Systems (LANCE) leverages existing satellite data processing systems in order to provide data and imagery available from select EOS instruments (currently AIRS, AMSR2, MLS, MODIS and OMI) within 3 hours of satellite overpass. These data meet the timely needs of applications such as numerical weather and climate prediction, forecasting and monitoring natural hazards, agriculture, air quality and disaster relief. The LANCE element for Advanced Microwave Scanning Radiometer 2 (AMSR2) is co-located with the AMSR Science Investigator-led Processing System (SIPS) at the Global Hydrology Resource Center (GHRC) DAAC in Huntsville, Alabama. NRT AMSR2 products are generated within three hours of observation, using preliminary algorithms provided by the NASA-funded US AMSR2 Science Team, with JAXA NRT L1R (resampled brightness temperatures) as input. While the NRT data stream from JAXA has a much lower latency than the corresponding standard data, it occasionally experiences some data loss. NASA standard products, to be generated using validated versions of these algorithms, will be available from NSIDC DAAC beginning in 2016. language code: en); insert Resource (id: null type: provider url: https://lance.nsstc.nasa.gov/);
change note: 2018-03-12 15:23:11.0 [tstevens] Insert Concept add broader relation (NASA/MSFC/GHRC/LANCE [9b194e6c-f499-43bf-9060-0adcb45e4f6d,310779] - NASA [4fd0aa9d-1a80-4dde-8452-c69b5c4d08cc,280081]);
in scheme: providers
definition: NASA’s Land, Atmosphere Near real-time Capability for Earth Observing Systems (LANCE) leverages existing satellite data processing systems in order to provide data and imagery available from select EOS instruments (currently AIRS, AMSR2, MLS, MODIS and OMI) within 3 hours of satellite overpass. These data meet the timely needs of applications such as numerical weather and climate prediction, forecasting and monitoring natural hazards, agriculture, air quality and disaster relief. The LANCE element for Advanced Microwave Scanning Radiometer 2 (AMSR2) is co-located with the AMSR Science Investigator-led Processing System (SIPS) at the Global Hydrology Resource Center (GHRC) DAAC in Huntsville, Alabama. NRT AMSR2 products are generated within three hours of observation, using preliminary algorithms provided by the NASA-funded US AMSR2 Science Team, with JAXA NRT L1R (resampled brightness temperatures) as input. While the NRT data stream from JAXA has a much lower latency than the corresponding standard data, it occasionally experiences some data loss. NASA standard products, to be generated using validated versions of these algorithms, will be available from NSIDC DAAC beginning in 2016.