HI/HEAR/HNRMD
type: Concept
in scheme: providers
definition: The Hawaiian Natural Resources Monitoring Database ("the Monitoring Database") is a software package designed as a tool for data entry and analysis for resource monitoring by land managers in Hawaii. The Monitoring Database is a product of the Research Corporation of the University of Hawaii. The software was developed using Paradox for Windows (Borland), chosen because of its combination of ease of use for end users AND flexibility of custom design (programming) capabilities. Summary Provided By: http://www.hear.org/monitoringdatabase/

HAWAII
type: Concept