NON-GOVERNMENT/NON-PROFIT ORGANIZATIONS
type: Concept

TERC
type: Concept
in scheme: providers
definition: We imagine a future in which learners from diverse communities engage in creative, rigorous, and reflective inquiry as an integral part of their lives. We see teachers and students alike as members of vibrant communities where questioning, problem solving, and experimentation are commonplace. Such communities focus on actual problems for which there are no simple solutions. Summary Provided By: http://www.terc.edu/aboutus/