TEMPERATE MIXED FOREST
type: Concept
change note: 2016-06-13 12:08:55.0 [gee-cee] insert Definition (id: null text: Pertaining to forests characterized by both coniferous and deciduous tree species. language code: en);
change note: 2016-06-13 12:08:33.0 [gee-cee] Insert Concept add broader relation (TEMPERATE MIXED FOREST [9cde47e7-325b-465e-93a6-ae4d459c7945,188181] - FORESTS [46e4aaa4-349c-4049-a910-035391360010,83507]);
in scheme: sciencekeywords
definition: Pertaining to forests characterized by both coniferous and deciduous tree species.

FORESTS
type: Concept