OK-STATE/GEOG/OCGI
type: Concept
in scheme: providers
definition: Oklahoma State University has received a $250,000 gift from Oklahoma City resident David Kniffin in honor of his late father to establish a faculty chair dedicated to library and education service. Once fully matched dollar-for-dollar by the Oklahoma State Regents for Higher Education as well as T. Boone Pickens’ $100 million chair match commitment, the gift will provide $1 million in endowed funds. Summary Provided By: http://osu.okstate.edu/

ACADEMIC
type: Concept