G - I
type: Concept

INTERKOSMOS
type: Concept
in scheme: projects
definition: The Interkosmos program of cooperation in space was decided by treaty on July, 13 1976. The space program was part of the work of the Council of Mutual Economic Cooperation (COMECOM). The Interkosmos space program finish with the dissolution of COMECOM on 1990. Information provided by http://flagspot.net/flags/qw-ikosm.html