ENLS
type: Concept
change note: 2014-01-23 11:18:36.0 [saritz] Added Preferred Alternate Label and Definition. insert AltLabel (id: null text: Earth Network Lightning Sensor language code: en); insert Definition (id: null text: The Earth Network Lightning Sensors (ENLS) have a unique sensor technology and patent pending system for the detection of lightning activity . This system has a broad frequency range extending from 1 Hz to 12 MHz which detects both in-cloud and cloud-to-ground lightning vs. competing lightning sensors operating in North America which are constrained to frequencies of up to just a few hundred kilohertz thus limiting in-cloud detection. language code: en);
change note: 2014-01-23 11:16:44.0 [saritz] Insert Concept add broader relation (ENLS [9d259111-dc99-4ca1-a4f3-d461c1d26636,106105] - Imaging Spectrometers/Radiometers [944b7691-af37-4fb4-9393-c114e7997829,74845]);
in scheme: instruments
definition: The Earth Network Lightning Sensors (ENLS) have a unique sensor technology and patent pending system for the detection of lightning activity . This system has a broad frequency range extending from 1 Hz to 12 MHz which detects both in-cloud and cloud-to-ground lightning vs. competing lightning sensors operating in North America which are constrained to frequencies of up to just a few hundred kilohertz thus limiting in-cloud detection.

Imaging Spectrometers/Radiometers
type: Concept