M - O
type: Concept

NIN
type: Concept
in scheme: projects
definition: The Northern Information Network (NIN) encourages information sharing about the Yukon, the Northwest Territories and Nunavut for more effective decision making in the areas such as resource management and economic development. NIN supports a variety of research initiatives in and about the North, including project impact assessments, sustainable development strategies, wildlife management planning, land-use planning, and emergency preparedness. Information provided by http://www.ainc-inac.gc.ca/esd/index-eng.asp