WIND STORMS
type: Concept

MICROBURST
type: Concept
change note: 2016-06-28 14:23:33.0 [saritz] insert Definition (id: null text: A downburst that covers an area less than 4 km along a side with peak winds that last 2–5 minutes language code: en);
change note: 2016-06-28 14:22:47.0 [saritz] Insert Concept add broader relation (MICROBURST [9da19ae9-799f-4885-8fb8-564ca803639a,217739] - WIND STORMS [c40071d2-6478-4edf-80bb-95c3886533b9,217737]);
in scheme: sciencekeywords
definition: A downburst that covers an area less than 4 km along a side with peak winds that last 2–5 minutes