SEA LEVEL RISE
type: Concept

INUNDATION
type: Concept
change note: 2012-07-05 15:37:23.0 [mpmorahan] insert Definition (id: null text: looding, by the rise and spread of water, of a land surface that is not normally submerged. language code: en);
change note: 2012-06-26 10:37:27.0 [gee-cee] Insert Concept add broader relation (INUNDATION [9db10fb2-0ceb-412e-9936-a286c579fa9f,39815] - SEA LEVEL RISE [536a86bd-3dd1-4f4a-9b4a-222a12746db5,39813]);
in scheme: sciencekeywords
definition: looding, by the rise and spread of water, of a land surface that is not normally submerged.