BANK REEF
type: Concept
change note: 2013-08-20 08:46:35.0 [tbs1979] insert Definition (id: null text: A linear or semi-circular shaped-outline, larger than a patch reef. language code: en);
change note: 2013-08-06 08:10:30.0 [tbs1979] Insert Concept add broader relation (BANK REEF [9ea0dbd4-2af5-4520-a831-32ee04d02ecc,105497] - CORAL REEFS [c6244bfb-300f-4818-bf45-cf1a15e7e073,105487]);
in scheme: sciencekeywords
definition: A linear or semi-circular shaped-outline, larger than a patch reef.

CORAL REEFS
type: Concept