ACADEMIC
type: Concept

UC-BERKELEY/M-PALEO
type: Concept
in scheme: providers
definition: The mission of the University of California Museum of Paleontology is to investigate and promote the understanding of the history of life and the diversity of the Earth's biota through research and education. Website: "http://www.ucmp.berkeley.edu/" [Summary provided by the University of California, Berkeley.]