CA/NRCAN/ESS/GSC/GDC
type: Concept
in scheme: providers
definition: Natural Resources Canada provides access to a rich and diverse array of information on the responsible development of Canada's natural resources, including maps, image and data collections, publications, and library and reference collections. Summary Provided by: http://www.nrcan-rncan.gc.ca/com/resoress/propro-eng.php

CANADA
type: Concept