SPATIALECON
type: Concept
change note: 2017-09-20 10:44:49.0 [tstevens] insert AltLabel (id: null category: primary text: Spatial Economic Data language code: en); insert Definition (id: null text: The purpose of this data collection is to provide spatial data on geographically based economic activity. The data may be of use in socioeconomic, environmental, climate, and other research. The first data set in this collection is the Global Gridded Geographically Based Economic Data (G-Econ), Version 4 containing derived one degree grid cells of Gross Domestic Product (GDP) data in GRID and ASCII formats for both Market Exchange Rate (MER) and Purchasing Power Parity (PPP) for the years 1990, 1995, 2000 and 2005. language code: en);
change note: 2017-09-20 10:42:57.0 [tstevens] Insert Concept add broader relation (SPATIALECON [9fe23057-575b-4e05-9310-222289663530,310205] - S - U [4eb1894b-35b4-406b-8864-944a42bc7702,292861]);
in scheme: projects
definition: The purpose of this data collection is to provide spatial data on geographically based economic activity. The data may be of use in socioeconomic, environmental, climate, and other research. The first data set in this collection is the Global Gridded Geographically Based Economic Data (G-Econ), Version 4 containing derived one degree grid cells of Gross Domestic Product (GDP) data in GRID and ASCII formats for both Market Exchange Rate (MER) and Purchasing Power Parity (PPP) for the years 1990, 1995, 2000 and 2005.

S - U
type: Concept