CA/NRCAN/ESS/GSC/BOOK
type: Concept
in scheme: providers
definition: The GSC is Canada's premier agency for geoscientific information and research, with world-class expertise focusing on geoscience surveys, sustainable development of Canada's resources, environmental protection, and technology innovation. Summary Provided By: http://gsc.nrcan.gc.ca/index_e.php

CANADA
type: Concept