JAPACS
type: Concept
in scheme: projects
definition: The Japanese Pacific Climate Study (JAPACS) program was launched by STA to study the impact of ENSO on the climate in and around the Pacific. Information provided by www.jamstec.go.jp/jamstec/TRITON/future/pdf/Contents1.pdf

J - L
type: Concept