CANAL
type: Concept
change note: 2016-06-15 07:40:16.0 [gee-cee] insert Definition (id: null text: Pertaining to artificial waterways used for navigation, crop irrigation, water supply, or drainage. language code: en);
change note: 2016-06-15 07:39:55.0 [gee-cee] Insert Concept add broader relation (CANAL [a0c33d15-b76c-4a0d-abb7-6919102b2977,188251] - URBAN LANDS [3e59af3d-500b-4c66-a9a1-76db5cf4a00b,85431]);
in scheme: sciencekeywords
definition: Pertaining to artificial waterways used for navigation, crop irrigation, water supply, or drainage.

URBAN LANDS
type: Concept