SOLAR RADIATION
type: Concept
in scheme: sciencekeywords
definition: Solar radiation is the total electromagnetic radiation emitted by the Sun. Also could include insolation, direct solar radiation, diffuse radiation, solar irradiance, and shortwave radiation.

ATMOSPHERIC RADIATION
type: Concept