MA
type: Concept
change note: 2014-10-14 09:03:48.0 [tbs1979] insert AltLabel (id: null text: Millennium Ecosystem Assessment language code: en);
change note: 2014-10-14 09:03:29.0 [tbs1979] Insert Concept add broader relation (MA [a16eea5f-58da-45ef-aa8e-3a36d059d777,106597] - M - O [a31c2828-9b6d-44e9-b6ad-7ae81030f322,77513]);
in scheme: projects
definition: The Millennium Ecosystem Assessment (MA) was called for by the United Nations Secretary-General Kofi Annan in 2000. Initiated in 2001, the objective of the MA was to assess the consequences of ecosystem change for human well-being and the scientific basis for action needed to enhance the conservation and sustainable use of those systems and their contribution to human well-being. The MA has involved the work of more than 1,360 experts worldwide. Their findings, contained in five technical volumes and six synthesis reports, provide a state-of-the-art scientific appraisal of the condition and trends in the world’s ecosystems and the services they provide (such as clean water, food, forest products, flood control, and natural resources) and the options to restore, conserve or enhance the sustainable use of ecosystems. http://www.millenniumassessment.org/en/index.html

M - O
type: Concept