UI-UC/LIBRARY
type: Concept
in scheme: providers
definition: The University of Illinois at Urbana-Champaign is the proud home of one of the largest and richest public research library collections in North America. Our 24 million items, the vast majority of which are paper and book-based, include Medieval manuscripts, large collections of incunabula and early printed books, literary manuscripts, maps and atlases, prints, and all sizes and types of printed books and other paper objects. The University Library is committed to sustaining and enhancing its capacity to treat and protect its important paper-based collections, with the majority of conservation and preservation-related investments focused on the care of its rare, unique, and otherwise valuable objects. Mission Statement of the University Library: The University Library is central to the intellectual life of the University. By providing and stewarding collections and content that comprise a current and retrospective record of human knowledge and by offering a wide array of services, it enhances the University’s activities in creating knowledge, preparing students for lives of impact, and addressing critical societal needs. The Library advances the University’s goals by ensuring unfettered access to information and by providing a network of expertise that ensures value, quality, and authenticity of information resources. The Library integrates and manages knowledge to enable learning and the creation of new knowledge.

ACADEMIC
type: Concept