METALS
type: Concept

METALS AGE DETERMINATIONS
type: Concept
change note: 2013-03-13 14:34:06.0 [tbs1979] insert Definition (id: null text: An analysis and determination of the age of metals language code: en);
change note: 2013-03-07 08:35:12.0 [tbs1979] Insert Concept add broader relation (METALS AGE DETERMINATIONS [a1b409b9-bf98-490a-8af5-f64fcda17a54,83141] - METALS [7b76bca5-32ee-4285-8550-0de120b01a13,63021]);
in scheme: sciencekeywords
definition: An analysis and determination of the age of metals