VT
type: Concept
in scheme: providers
definition: Video Transfer Inc. provides customers with a wide range of services such as DVD duplication, Macrovison, CD/DVD packaging, CD replication, CD/DVD creation, tape to tape transfer and multimedia services. Video Transfer Inc. has been setting the media replication standards since the mid 1980's and is considered The Media Replication Source. We’re so serious about DVD & CD replication, for instance, that we replicate discs in a Class 1000 Clean Room for a flawless, immaculate reproduction process. One source, one stop... all in-house. Let us show you how Video Transfer Inc. can take your media projects to the next level. We will accomplish authoring, replication, and duplication of all your multimedia content. We can also convert video to DVD, if it's time to update your corporate videos, or other multimedia productions. With our DVD duplication, DVD authoring and multimedia production services, we can handle all of your creative needs. Summary provided by http://www.vtiboston.com/

COMMERCIAL
type: Concept