WEATHER EVENTS
type: Concept

HAIL STORMS
type: Concept
change note: 2016-07-01 14:05:47.0 [saritz] insert Definition (id: null text: Any storm that produces hailstones that fall to the ground; usually used when the amount or size of the hail is considered significant. language code: en);
change note: 2016-07-01 14:05:10.0 [saritz] Insert Concept add broader relation (HAIL STORMS [a2ea1792-c011-4c7c-95c7-3bd648b1b57b,217807] - ATMOSPHERIC PHENOMENA [b7d562cf-9b9b-4461-900b-50423a8c4d29,83679]);
in scheme: sciencekeywords
definition: Any storm that produces hailstones that fall to the ground; usually used when the amount or size of the hail is considered significant.