CHEVRON
type: Concept
in scheme: providers
definition: Chevron is one of the world's largest integrated energy companies. Headquartered in San Ramon, California, we conduct business in more than 100 countries. We are engaged in every aspect of the oil and natural gas industry, including exploration and production, manufacturing, marketing and transportation, chemicals manufacturing and sales, geothermal, and power generation. We're also investing in renewables and advanced technologies. Summary Provided By: http://www.chevron.com/about/leadership/

COMMERCIAL
type: Concept