WATER CHARACTERISTICS
type: Concept

SALINE CONCENTRATION
type: Concept
change note: 2018-03-14 09:30:23.0 [tstevens] update Definition (Fundamentals of Chemistry);
change note: 2018-03-07 12:35:26.0 [tstevens] insert Definition (id: null text: The concentration of dissolved salts in water, usually expressed in parts per thousand (permille, %) or parts per million (ppm). The United States Geological Survey classifies saline water in three salinity categories. Salt concentration in slightly saline water is around 1,000 to 3,000 ppm (0.1–0.3%), in moderately saline water 3,000 to 10,000 ppm (0.3–1%) and in highly saline water 10,000 to 35,000 ppm (1–3.5%). Seawater has a salinity of roughly 35,000 ppm, equivalent to 35 grams of salt per one liter (or kilogram) of water. language code: en);
change note: 2018-03-07 08:30:05.0 [tstevens] Insert Concept add broader relation (SALINE CONCENTRATION [a38db528-3064-449d-ae70-af86997a11f4,310687] - WATER CHARACTERISTICS [f7e97dc3-1181-41b5-8b90-946eb2504110,310633]);
in scheme: sciencekeywords
definition: The concentration of dissolved salts in water, usually expressed in parts per thousand (permille, %) or parts per million (ppm). The United States Geological Survey classifies saline water in three salinity categories. Salt concentration in slightly saline water is around 1,000 to 3,000 ppm (0.1–0.3%), in moderately saline water 3,000 to 10,000 ppm (0.3–1%) and in highly saline water 10,000 to 35,000 ppm (1–3.5%). Seawater has a salinity of roughly 35,000 ppm, equivalent to 35 grams of salt per one liter (or kilogram) of water.