NY/DEC/DFWMR/MARINE
type: Concept
in scheme: providers
definition: The Bureau of Marine Resources headquarters is located in East Setauket, New York on Long Island and serves the entire marine and coastal district of the State of New York. The marine and coastal district includes all the waters of the Atlantic Ocean within three nautical miles from the state coastline, including Long Island Sound and the Hudson River up to the Tappan Zee Bridge. The bureau protects and manages marine fisheries and habitats for all New Yorkers to enjoy. The web site ("http://www.dec.state.ny.us/website/dfwmr/marine/") offers information on saltwater fishing, shellfish, Long Island Sound, and even state saltwater fishing records. Information on New York's laws and regulations that affect the use and management of our marine resources can also be found. [Source: "http://www.dec.state.ny.us/website/dfwmr/marine/"]

NEW YORK
type: Concept