U-BERN/PI/CEP
type: Concept
in scheme: providers
definition: The Princeton University Geosciences Department, together with its affiliated inter-departmental programs and institutes, serves as the central focus for the earth, atmospheric, oceanographic, and environmental sciences. Work at the department includes measurement and modeling of global climatic change, to high-pressure mineral physics, to seismic topographic imaging of the mantle under the continents, to analysis of the tectonics of Venus. Website: "http://geoweb.princeton.edu/" [Summary provided by Princeton University.]

ACADEMIC
type: Concept