BIRDS
type: Concept

PENGUINS
type: Concept
change note: 2017-03-15 09:23:47.0 [mgenazzi] Definition added insert Definition (id: null text: Phylum Chordata. Class Aves. Order Sphenisciformes. Penguins are flightless aquatic birds, with countershaded bodies and evolved wings into flippers. language code: en);
in scheme: sciencekeywords
definition: Phylum Chordata. Class Aves. Order Sphenisciformes. Penguins are flightless aquatic birds, with countershaded bodies and evolved wings into flippers.