GLACIER ACCUMULATION
type: Concept
change note: 2023-04-04 13:02:53.0 [tstevens] insert Definition (id: null text: Mass gained by a glacier from all processes. language code: en);
change note: 2023-04-04 13:00:35.0 [tstevens] Insert Concept add broader relation (GLACIER ACCUMULATION [a4edf013-e60b-4646-aac3-b9ca3d37c1cd,1276533] - GLACIERS [4a426aab-4a95-4bf4-8449-19a72a251541,1273915]);
in scheme: sciencekeywords
definition: Mass gained by a glacier from all processes.

GLACIERS
type: Concept