ENVIRONMENTAL IMPACTS
type: Concept

CHEMICAL SPILLS
type: Concept
change note: 2012-07-11 09:51:31.0 [tbs1979] update Definition (United States Environmental Protection Agency (U.S. EPA)); update Definition (The release into the environment of any solid, liquid, or gaseous material that may pose substantial hazard to human health, to property, and to the environment.);
in scheme: sciencekeywords
definition: The release into the environment of any solid, liquid, or gaseous material that may pose substantial hazard to human health, to property, and to the environment.