ATLAS-1
type: Concept
change note: 2022-04-21 08:23:58.0 [tstevens] insert Definition (id: null text: ATLAS missions were part of Phase I of NASA's Mission to Planet Earth, a large-scale, unified study of planet Earth as a single, dynamic system. Throughout the ATLAS series, scientists gathered new information to gain a better understanding of how the atmosphere reacts to natural and human-induced atmospheric changes. That knowledge helped us identify measures to keep our planet suitable for life for future generations. ATLAS-1 flew aboard Space Shuttle Atlantis on mission STS-45 in spring 1992. It was the first of up to nine ATLAS missions that were undertaken throughout one solar cycle, which lasted 11 years. During that period solar flares, sunspots and other magnetic activity in the sun changes from one extreme to the other and back. language code: en);
change note: 2022-04-20 12:45:48.0 [tstevens] Insert Concept add broader relation (ATLAS-1 [a5cdaa1d-0ca7-4b37-bb53-166f9f168430,894383] - Space Shuttle [3ef93fbf-1e19-42a9-a91f-502d125dbb7c,884518]);
change note: 2022-04-20 12:48:48.0 [tstevens] insert AltLabel (id: null category: primary text: Atmospheric Laboratory for Applications and Science-1 language code: en);
definition: ATLAS missions were part of Phase I of NASA's Mission to Planet Earth, a large-scale, unified study of planet Earth as a single, dynamic system. Throughout the ATLAS series, scientists gathered new information to gain a better understanding of how the atmosphere reacts to natural and human-induced atmospheric changes. That knowledge helped us identify measures to keep our planet suitable for life for future generations. ATLAS-1 flew aboard Space Shuttle Atlantis on mission STS-45 in spring 1992. It was the first of up to nine ATLAS missions that were undertaken throughout one solar cycle, which lasted 11 years. During that period solar flares, sunspots and other magnetic activity in the sun changes from one extreme to the other and back.
in scheme: platforms

Space Shuttle
type: Concept