NEUTRON MONITOR STATIONS
type: Concept
change note: 2022-02-08 12:58:25.0 [tstevens] insert Definition (id: null text: Ground-based detector designed to measure the number of high-energy charged particles striking the Earth's atmosphere from outer space. language code: en);
change note: 2021-11-17 14:07:55.0 [tstevens] Move Concepts delete broader relation (null); add broader relation (NEUTRON MONITOR STATIONS [a5e3eadc-b8a0-4b3b-92e4-10ae18e3041f,826589] - Permanent Land Sites [0ec10fd9-492c-498a-b6d8-e2840cc3643b,835887]);
in scheme: platforms
definition: Ground-based detector designed to measure the number of high-energy charged particles striking the Earth's atmosphere from outer space.

Permanent Land Sites
type: Concept