CONSORTIA/INSTITUTIONS
type: Concept

ITIS
type: Concept
in scheme: providers
definition: The White House Subcommittee on Biodiversity and Ecosystem Dynamics has identified systematics as a research priority that is fundamental to ecosystem management and biodiversity conservation. This primary need identified by the Subcommittee requires improvements in the organization of, and access to, standardized nomenclature. ITIS (originally referred to as the Interagency Taxonomic Information System) was designed to fulfill these requirements. In the future, the ITIS will provide taxonomic data and a directory of taxonomic expertise that will support the system. Summary Provided By: http://www.itis.gov/info.html