CRUSTAL MOTION DIRECTION
type: Concept
change note: 2013-04-02 09:14:28.0 [tbs1979] insert Definition (id: null text: The direction in which the Earth's crust moves. language code: en);
change note: 2013-03-08 13:19:50.0 [tbs1979] Insert Concept add broader relation (CRUSTAL MOTION DIRECTION [a629b645-2c5f-48d6-8363-71bc636457d6,83187] - CRUSTAL MOTION [8dd8d272-fb6d-4eec-882a-f3be98800b42,83183]);
in scheme: sciencekeywords
definition: The direction in which the Earth's crust moves.

CRUSTAL MOTION
type: Concept