HABITAT CONVERSION/FRAGMENTATION
type: Concept

ECOLOGICAL CORRIDORS
type: Concept
alternative label: WILDLIFE CORRIDORS
alternative label: GREEN CORRIDORS
alternative label: HABITAT CORRIDORS
definition: An area of habitat connecting wildlife populations separated by human activities or structures.
in scheme: sciencekeywords
change note: 2019-07-15 12:46:29.0 [mmorahan] Insert Concept add broader relation (ECOLOGICAL CORRIDORS [a66ec515-6a6e-487b-9004-2d19d6ffff04,368967] - HABITAT CONVERSION/FRAGMENTATION [f1682ed1-2d9c-41ec-9553-49b9ab55df9b,83651]);